Target
Transmembrane domain-containing protein TMIGD3
Ligand
BDBM50500113
Substrate
Meas. Tech.
ChEMBL_1546516 (CHEMBL3749019)
Ki
1.2±n/a nM
Citation
 Tosh, DKPaoletta, SChen, ZCrane, SLloyd, JGao, ZGGizewski, ETAuchampach, JASalvemini, DJacobson, KA Structure-Based Design, Synthesis by Click Chemistry and  Medchemcomm 6:555-563 
Target
Name:
Transmembrane domain-containing protein TMIGD3
Synonyms:
TMIG3_HUMAN Transmembrane domain-containing protein TMIGD3
Type:
PROTEIN
Mol. Mass.:
30335.79
Organism:
Homo sapiens (Human)
Description:
ChEMBL_114868
Residue:
266
  
Inhibitor
Name:
BDBM50500113
Synonyms:
CHEMBL3747461
Type:
Small organic molecule
Emp. Form.:
C15H19IN6O3
Mol. Mass.:
458.2542
SMILES:
[H][C@]12C[C@]1([C@@H](O)[C@@H](O)[C@@H]2n1cnc2c(NCC)nc(I)nc12)C(=O)NC
: