Target
Prostaglandin G/H synthase 1
Ligand
BDBM50049647
Substrate
Meas. Tech.
ChEMBL_158742 (CHEMBL768749)
IC50
17900±n/a nM
Citation
 Li, JJNorton, MBReinhard, EJAnderson, GDGregory, SAIsakson, PCKoboldt, CMMasferrer, JLPerkins, WESeibert, KZhang, YZweifel, BSReitz, DB Novel terphenyls as selective cyclooxygenase-2 inhibitors and orally active anti-inflammatory agents. J Med Chem 39:1846-56 (1996)  
Target
Name:
Prostaglandin G/H synthase 1
Synonyms:
COX-1 Cyclooxygenase Cyclooxygenase-1 (COX-1) PTGS1 | Prostaglandin G/H synthase (cyclooxygenase)
Type:
Enzyme
Mol. Mass.:
68692.62
Organism:
Homo sapiens (Human)
Description:
P23219
Residue:
599
  
Inhibitor
Name:
BDBM50049647
Synonyms:
2'-(2,3-Dihydro-benzo[1,4]dioxin-6-yl)-4',5'-difluoro-biphenyl-4-sulfonic acid amide | CHEMBL55395
Type:
Small organic molecule
Emp. Form.:
C20H15F2NO4S
Mol. Mass.:
403.399
SMILES:
NS(=O)(=O)c1ccc(cc1)-c1cc(F)c(F)cc1-c1ccc2OCCOc2c1
: