Target
Prostaglandin G/H synthase 1
Ligand
BDBM50049633
Substrate
Meas. Tech.
ChEMBL_158742 (CHEMBL768749)
IC50
9200±n/a nM
Citation
 Li, JJNorton, MBReinhard, EJAnderson, GDGregory, SAIsakson, PCKoboldt, CMMasferrer, JLPerkins, WESeibert, KZhang, YZweifel, BSReitz, DB Novel terphenyls as selective cyclooxygenase-2 inhibitors and orally active anti-inflammatory agents. J Med Chem 39:1846-56 (1996)  
Target
Name:
Prostaglandin G/H synthase 1
Synonyms:
COX-1 Cyclooxygenase Cyclooxygenase-1 (COX-1) PTGS1 | Prostaglandin G/H synthase (cyclooxygenase)
Type:
Enzyme
Mol. Mass.:
68692.62
Organism:
Homo sapiens (Human)
Description:
P23219
Residue:
599
  
Inhibitor
Name:
BDBM50049633
Synonyms:
3-Chloro-4-fluoro-[1,1'';2'',1'''']terphenyl-4''''-sulfonic acid amide CHEMBL54412
Type:
Small organic molecule
Emp. Form.:
C18H13ClFNO2S
Mol. Mass.:
361.818
SMILES:
NS(=O)(=O)c1ccc(cc1)-c1ccccc1-c1ccc(F)c(Cl)c1
: