Target
Prostaglandin G/H synthase 2
Ligand
BDBM50049633
Substrate
Meas. Tech.
ChEMBL_159753 (CHEMBL762917)
IC50
17±n/a nM
Citation
 Li, JJNorton, MBReinhard, EJAnderson, GDGregory, SAIsakson, PCKoboldt, CMMasferrer, JLPerkins, WESeibert, KZhang, YZweifel, BSReitz, DB Novel terphenyls as selective cyclooxygenase-2 inhibitors and orally active anti-inflammatory agents. J Med Chem 39:1846-56 (1996)  
Target
Name:
Prostaglandin G/H synthase 2
Synonyms:
COX2 Cyclooxygenase 2 (COX-2) Cyclooxygenase-2 (COX-2 AA) Cyclooxygenase-2 (COX-2) PGH2_HUMAN PHS II Prostaglandin E synthase/G/H synthase 2 Prostaglandin-endoperoxide synthase 2
Type:
Enzyme
Mol. Mass.:
69003.89
Organism:
Homo sapiens (Human)
Description:
Recombinant Cox-2 provided by Cayman (Cayman Chemical Co.,Ann Arbor, MI).
Residue:
604
  
Inhibitor
Name:
BDBM50049633
Synonyms:
3-Chloro-4-fluoro-[1,1'';2'',1'''']terphenyl-4''''-sulfonic acid amide CHEMBL54412
Type:
Small organic molecule
Emp. Form.:
C18H13ClFNO2S
Mol. Mass.:
361.818
SMILES:
NS(=O)(=O)c1ccc(cc1)-c1ccccc1-c1ccc(F)c(Cl)c1
: