Target
Cholecystokinin receptor type A
Ligand
BDBM50049783
Substrate
Meas. Tech.
ChEMBL_50056 (CHEMBL662425)
IC50
4080±n/a nM
Citation
 Castro, JLBall, RGBroughton, HBRussell, MGRathbone, DWatt, APBaker, RChapman, KLFletcher, AEPatel, SSmith, AJMarshall, GRRyecroft, WMatassa, VG Controlled modification of acidity in cholecystokinin B receptor antagonists: N-(1,4-benzodiazepin-3-yl)-N'-[3-(tetrazol-5-ylamino) phenyl]ureas. J Med Chem 39:842-9 (1996)  
Target
Name:
Cholecystokinin receptor type A
Synonyms:
CCKAR_RAT Cholecystokinin peripheral Cholecystokinin receptor type A
Type:
Enzyme Catalytic Domain
Mol. Mass.:
49676.37
Organism:
RAT
Description:
Cholecystokinin central 0 RAT::P30551
Residue:
444
  
Inhibitor
Name:
BDBM50049783
Synonyms:
1-((R)-1-Methyl-2-oxo-5-phenyl-2,3-dihydro-1H-benzo[e][1,4]diazepin-3-yl)-3-[1-(1H-tetrazol-5-yl)-2,3-dihydro-1H-indol-6-yl]-urea | CHEMBL166941
Type:
Small organic molecule
Emp. Form.:
C26H23N9O2
Mol. Mass.:
493.5199
SMILES:
CN1c2ccccc2C(=N[C@@H](NC(=O)Nc2ccc3CCN(c4nnn[nH]4)c3c2)C1=O)c1ccccc1
: