Target
Cholecystokinin receptor type A
Ligand
BDBM50049784
Substrate
Meas. Tech.
ChEMBL_50056 (CHEMBL662425)
IC50
3000±n/a nM
Citation
 Castro, JLBall, RGBroughton, HBRussell, MGRathbone, DWatt, APBaker, RChapman, KLFletcher, AEPatel, SSmith, AJMarshall, GRRyecroft, WMatassa, VG Controlled modification of acidity in cholecystokinin B receptor antagonists: N-(1,4-benzodiazepin-3-yl)-N'-[3-(tetrazol-5-ylamino) phenyl]ureas. J Med Chem 39:842-9 (1996)  
Target
Name:
Cholecystokinin receptor type A
Synonyms:
CCKAR_RAT Cholecystokinin peripheral Cholecystokinin receptor type A
Type:
Enzyme Catalytic Domain
Mol. Mass.:
49676.37
Organism:
RAT
Description:
Cholecystokinin central 0 RAT::P30551
Residue:
444
  
Inhibitor
Name:
BDBM50049784
Synonyms:
1-((R)-1-Methyl-2-oxo-5-phenyl-2,3-dihydro-1H-benzo[e][1,4]diazepin-3-yl)-3-{3-[(1H-tetrazol-5-ylamino)-methyl]-phenyl}-urea | CHEMBL168903
Type:
Small organic molecule
Emp. Form.:
C25H23N9O2
Mol. Mass.:
481.5092
SMILES:
CN1c2ccccc2C(=N[C@@H](NC(=O)Nc2cccc(CNc3nnn[nH]3)c2)C1=O)c1ccccc1
: