Target
Kappa-type opioid receptor
Ligand
BDBM50049807
Substrate
Meas. Tech.
ChEMBL_146367 (CHEMBL759287)
Ki
1±n/a nM
Citation
 Cappelli, AAnzini, MVomero, SMenziani, MCDe Benedetti, PGSbacchi, MClarke, GDMennuni, L Synthesis, biological evaluation, and quantitative receptor docking simulations of 2-[(acylamino)ethyl]-1,4-benzodiazepines as novel tifluadom-like ligands with high affinity and selectivity for kappa-opioid receptors. J Med Chem 39:860-72 (1996)  
Target
Name:
Kappa-type opioid receptor
Synonyms:
Kappa Opioid Receptor OPRK1 Opiate Kappa 1 | mu/kappa opioid receptor
Type:
G Protein-Coupled Receptor (GPCR)
Mol. Mass.:
42744.99
Organism:
Cavia porcellus (domestic guinea pig)
Description:
P41144
Residue:
380
  
Inhibitor
Name:
BDBM50049807
Synonyms:
2-Fluoro-N-[2-(1-methyl-5-phenyl-2,3-dihydro-1H-benzo[e][1,4]diazepin-2-yl)-ethyl]-benzamide | CHEMBL341529
Type:
Small organic molecule
Emp. Form.:
C25H24FN3O
Mol. Mass.:
401.476
SMILES:
CN1C(CCNC(=O)c2ccccc2F)CN=C(c2ccccc2)c2ccccc12
: