Target
Endothelin receptor type B
Ligand
BDBM50050052
Substrate
Meas. Tech.
ChEMBL_63697 (CHEMBL670653)
IC50
>100000±n/a nM
Citation
 von Geldern, TWHoffman, DJKester, JANellans, HNDayton, BDCalzadilla, SVMarsh, KCHernandez, LChiou, WDixon, DBWu-Wong, JROpgenorth, TJ Azole endothelin antagonists. 3. Using delta log P as a tool to improve absorption. J Med Chem 39:982-91 (1996)  
Target
Name:
Endothelin receptor type B
Synonyms:
EDNRB ENDOTHELIN B ETRB Endothelin receptor non-selective type | Endothelin receptor, ET-A/ET-B
Type:
Enzyme Catalytic Domain
Mol. Mass.:
49664.00
Organism:
Homo sapiens (Human)
Description:
ENDOTHELIN B EDNRB HUMAN::P24530
Residue:
442
  
Inhibitor
Name:
BDBM50050052
Synonyms:
2-[(R)-1-[(S)-2-(3-Cyclohexyl-1-methyl-ureido)-4-methyl-pentanoylamino]-2-(1-methyl-1H-indol-3-yl)-ethyl]-5-methyl-oxazole-4-carboxylic acid | CHEMBL369821
Type:
Small organic molecule
Emp. Form.:
C30H41N5O5
Mol. Mass.:
551.677
SMILES:
CC(C)C[C@H](N(C)C(=O)NC1CCCCC1)C(=O)N[C@H](Cc1cn(C)c2ccccc12)c1nc(C(O)=O)c(C)o1
: