Target
Tubulin beta chain
Ligand
BDBM50014846
Substrate
Meas. Tech.
ChEMBL_1546324 (CHEMBL3748555)
IC50
2100±n/a nM
Citation
 Colley, HEMuthana, MDanson, SJJackson, LVBrett, MLHarrison, JCoole, SFMason, DPJennings, LRWong, MTulasi, VNorman, DLockey, PMWilliams, LDossetter, AGGriffen, EJThompson, MJ An Orally Bioavailable, Indole-3-glyoxylamide Based Series of Tubulin Polymerization Inhibitors Showing Tumor Growth Inhibition in a Mouse Xenograft Model of Head and Neck Cancer. J Med Chem 58:9309-33 (2015)  
Target
Name:
Tubulin beta chain
Synonyms:
Beta-tubulin Tubulin beta chain
Type:
PROTEIN
Mol. Mass.:
49840.26
Organism:
Sus scrofa
Description:
ChEMBL_105107
Residue:
445
  
Inhibitor
Name:
BDBM50014846
Synonyms:
(S)-N-(5,6,7,9-tetrahydro-1,2,3,10-tetramethoxy-9-oxobenzo[a]heptalen-7-yl)acetamide 7alphaH-colchicine COLCHICINE colchicina | colchicinum
Type:
Small organic molecule
Emp. Form.:
C22H25NO6
Mol. Mass.:
399.437
SMILES:
COc1cc2CC[C@H](NC(C)=O)c3cc(=O)c(OC)ccc3-c2c(OC)c1OC
: