Target
Histamine H3 receptor
Ligand
BDBM50050171
Substrate
Meas. Tech.
ChEMBL_83825 (CHEMBL691842)
Ki
7.9±n/a nM
Citation
 Stark, HPurand, KHüls, ALigneau, XGarbarg, MSchwartz, JCSchunack, W [125I]iodoproxyfan and related compounds: a reversible radioligand and novel classes of antagonists with high affinity and selectivity for the histamine H3 receptor. J Med Chem 39:1220-6 (1996)  
Target
Name:
Histamine H3 receptor
Synonyms:
HH3R Hrh3
Type:
G Protein-Coupled Receptor (GPCR)
Mol. Mass.:
48607.98
Organism:
Rattus norvegicus (rat)
Description:
Residue:
445
  
Inhibitor
Name:
BDBM50050171
Synonyms:
(3-Iodo-phenyl)-carbamic acid 3-(1H-imidazol-4-yl)-propyl ester | CHEMBL20064
Type:
Small organic molecule
Emp. Form.:
C13H14IN3O2
Mol. Mass.:
371.1736
SMILES:
Ic1cccc(NC(=O)OCCCc2cnc[nH]2)c1
: