Target
Histamine H3 receptor
Ligand
BDBM50050172
Substrate
Meas. Tech.
ChEMBL_86903 (CHEMBL698413)
Ki
30±n/a nM
Citation
 Stark, HPurand, KHüls, ALigneau, XGarbarg, MSchwartz, JCSchunack, W [125I]iodoproxyfan and related compounds: a reversible radioligand and novel classes of antagonists with high affinity and selectivity for the histamine H3 receptor. J Med Chem 39:1220-6 (1996)  
Target
Name:
Histamine H3 receptor
Synonyms:
HH3R Hrh3
Type:
G Protein-Coupled Receptor (GPCR)
Mol. Mass.:
48607.98
Organism:
Rattus norvegicus (rat)
Description:
Residue:
445
  
Inhibitor
Name:
BDBM50050172
Synonyms:
3-Iodo-4-methyl-benzoic acid 3-(1H-imidazol-4-yl)-propyl ester | CHEMBL20211
Type:
Small organic molecule
Emp. Form.:
C14H15IN2O2
Mol. Mass.:
370.1856
SMILES:
Cc1ccc(cc1I)C(=O)OCCCc1cnc[nH]1
: