Target
Histamine H3 receptor
Ligand
BDBM50050175
Substrate
Meas. Tech.
ChEMBL_86903 (CHEMBL698413)
Ki
35±n/a nM
Citation
 Stark, HPurand, KHüls, ALigneau, XGarbarg, MSchwartz, JCSchunack, W [125I]iodoproxyfan and related compounds: a reversible radioligand and novel classes of antagonists with high affinity and selectivity for the histamine H3 receptor. J Med Chem 39:1220-6 (1996)  
Target
Name:
Histamine H3 receptor
Synonyms:
HH3R Hrh3
Type:
G Protein-Coupled Receptor (GPCR)
Mol. Mass.:
48607.98
Organism:
Rattus norvegicus (rat)
Description:
Residue:
445
  
Inhibitor
Name:
BDBM50050175
Synonyms:
4-{3-[3-(4-Iodo-phenyl)-propoxy]-propyl}-1H-imidazole | CHEMBL20686
Type:
Small organic molecule
Emp. Form.:
C15H19IN2O
Mol. Mass.:
370.2286
SMILES:
Ic1ccc(CCCOCCCc2cnc[nH]2)cc1
: