Target
Histamine H3 receptor
Ligand
BDBM50050176
Substrate
Meas. Tech.
ChEMBL_83825 (CHEMBL691842)
Ki
31.62±n/a nM
Citation
 Stark, HPurand, KHüls, ALigneau, XGarbarg, MSchwartz, JCSchunack, W [125I]iodoproxyfan and related compounds: a reversible radioligand and novel classes of antagonists with high affinity and selectivity for the histamine H3 receptor. J Med Chem 39:1220-6 (1996)  
Target
Name:
Histamine H3 receptor
Synonyms:
HH3R Hrh3
Type:
G Protein-Coupled Receptor (GPCR)
Mol. Mass.:
48607.98
Organism:
Rattus norvegicus (rat)
Description:
Residue:
445
  
Inhibitor
Name:
BDBM50050176
Synonyms:
4-Amino-3,5-diiodo-benzoic acid 3-(1H-imidazol-4-yl)-propyl ester | CHEMBL20357
Type:
Small organic molecule
Emp. Form.:
C13H13I2N3O2
Mol. Mass.:
497.0702
SMILES:
Nc1c(I)cc(cc1I)C(=O)OCCCc1cnc[nH]1
: