Target
Histamine H3 receptor
Ligand
BDBM50050168
Substrate
Meas. Tech.
ChEMBL_83825 (CHEMBL691842)
Ki
79.43±n/a nM
Citation
 Stark, HPurand, KHüls, ALigneau, XGarbarg, MSchwartz, JCSchunack, W [125I]iodoproxyfan and related compounds: a reversible radioligand and novel classes of antagonists with high affinity and selectivity for the histamine H3 receptor. J Med Chem 39:1220-6 (1996)  
Target
Name:
Histamine H3 receptor
Synonyms:
HH3R Hrh3
Type:
G Protein-Coupled Receptor (GPCR)
Mol. Mass.:
48607.98
Organism:
Rattus norvegicus (rat)
Description:
Residue:
445
  
Inhibitor
Name:
BDBM50050168
Synonyms:
3-(4-Iodo-phenyl)-propionic acid 3-(1H-imidazol-4-yl)-propyl ester | CHEMBL423473
Type:
Small organic molecule
Emp. Form.:
C15H17IN2O2
Mol. Mass.:
384.2122
SMILES:
Ic1ccc(CCC(=O)OCCCc2cnc[nH]2)cc1
: