Target
Dihydrofolate reductase
Ligand
BDBM50029772
Substrate
Meas. Tech.
ChEMBL_52980 (CHEMBL664188)
IC50
13±n/a nM
Citation
 Piper, JRJohnson, CAKrauth, CACarter, RLHosmer, CAQueener, SFBorotz, SEPfefferkorn, ER Lipophilic antifolates as agents against opportunistic infections. 1. Agents superior to trimetrexate and piritrexim against Toxoplasma gondii and Pneumocystis carinii in in vitro evaluations. J Med Chem 39:1271-80 (1996)  
Target
Name:
Dihydrofolate reductase
Synonyms:
DYR_PNECA Dihydrofolate reductase Tetrahydrofolate dehydrogenase
Type:
Enzyme
Mol. Mass.:
23891.29
Organism:
Pneumocystis carinii
Description:
Residue:
206
  
Inhibitor
Name:
BDBM50029772
Synonyms:
5-Methyl-6-[(3,4,5-trimethoxy-phenylamino)-methyl]-pyrido[2,3-d]pyrimidine-2,4-diamine | CHEMBL23532
Type:
Small organic molecule
Emp. Form.:
C18H22N6O3
Mol. Mass.:
370.4057
SMILES:
COc1cc(NCc2cnc3nc(N)nc(N)c3c2C)cc(OC)c1OC
: