Target
Dihydrofolate reductase
Ligand
BDBM50050382
Substrate
Meas. Tech.
ChEMBL_52980 (CHEMBL664188)
IC50
21200±n/a nM
Citation
 Piper, JRJohnson, CAKrauth, CACarter, RLHosmer, CAQueener, SFBorotz, SEPfefferkorn, ER Lipophilic antifolates as agents against opportunistic infections. 1. Agents superior to trimetrexate and piritrexim against Toxoplasma gondii and Pneumocystis carinii in in vitro evaluations. J Med Chem 39:1271-80 (1996)  
Target
Name:
Dihydrofolate reductase
Synonyms:
DYR_PNECA Dihydrofolate reductase Tetrahydrofolate dehydrogenase
Type:
Enzyme
Mol. Mass.:
23891.29
Organism:
Pneumocystis carinii
Description:
Residue:
206
  
Inhibitor
Name:
BDBM50050382
Synonyms:
6-m-Tolylsulfanylmethyl-pteridine-2,4-diamine | CHEMBL286820
Type:
Small organic molecule
Emp. Form.:
C14H14N6S
Mol. Mass.:
298.366
SMILES:
Cc1cccc(SCc2cnc3nc(N)nc(N)c3n2)c1
: