Target
Bifunctional dihydrofolate reductase-thymidylate synthase
Ligand
BDBM50034928
Substrate
Meas. Tech.
ChEMBL_53465 (CHEMBL665590)
IC50
240±n/a nM
Citation
 Piper, JRJohnson, CAKrauth, CACarter, RLHosmer, CAQueener, SFBorotz, SEPfefferkorn, ER Lipophilic antifolates as agents against opportunistic infections. 1. Agents superior to trimetrexate and piritrexim against Toxoplasma gondii and Pneumocystis carinii in in vitro evaluations. J Med Chem 39:1271-80 (1996)  
Target
Name:
Bifunctional dihydrofolate reductase-thymidylate synthase
Synonyms:
DHFR-TS Dihydrofolate reductase Dihydrofolate reductase; T. gondii vs rat
Type:
Enzyme
Mol. Mass.:
68757.49
Organism:
Toxoplasma gondii
Description:
Q07422
Residue:
610
  
Inhibitor
Name:
BDBM50034928
Synonyms:
5-Methyl-6-(naphthalen-1-ylaminomethyl)-pyrido[2,3-d]pyrimidine-2,4-diamine | CHEMBL23867
Type:
Small organic molecule
Emp. Form.:
C19H18N6
Mol. Mass.:
330.3864
SMILES:
Cc1c(CNc2cccc3ccccc23)cnc2nc(N)nc(N)c12
: