Target
Bifunctional dihydrofolate reductase-thymidylate synthase
Ligand
BDBM50050393
Substrate
Meas. Tech.
ChEMBL_53465 (CHEMBL665590)
IC50
90±n/a nM
Citation
 Piper, JRJohnson, CAKrauth, CACarter, RLHosmer, CAQueener, SFBorotz, SEPfefferkorn, ER Lipophilic antifolates as agents against opportunistic infections. 1. Agents superior to trimetrexate and piritrexim against Toxoplasma gondii and Pneumocystis carinii in in vitro evaluations. J Med Chem 39:1271-80 (1996)  
Target
Name:
Bifunctional dihydrofolate reductase-thymidylate synthase
Synonyms:
DHFR-TS Dihydrofolate reductase Dihydrofolate reductase; T. gondii vs rat
Type:
Enzyme
Mol. Mass.:
68757.49
Organism:
Toxoplasma gondii
Description:
Q07422
Residue:
610
  
Inhibitor
Name:
BDBM50050393
Synonyms:
6-(3-Chloro-phenylsulfanylmethyl)-5-methyl-pyrido[2,3-d]pyrimidine-2,4-diamine | CHEMBL24007
Type:
Small organic molecule
Emp. Form.:
C15H14ClN5S
Mol. Mass.:
331.823
SMILES:
Cc1c(CSc2cccc(Cl)c2)cnc2nc(N)nc(N)c12
: