Target
Dihydrofolate reductase
Ligand
BDBM50050409
Substrate
Meas. Tech.
ChEMBL_55115 (CHEMBL665442)
IC50
140±n/a nM
Citation
 Piper, JRJohnson, CAKrauth, CACarter, RLHosmer, CAQueener, SFBorotz, SEPfefferkorn, ER Lipophilic antifolates as agents against opportunistic infections. 1. Agents superior to trimetrexate and piritrexim against Toxoplasma gondii and Pneumocystis carinii in in vitro evaluations. J Med Chem 39:1271-80 (1996)  
Target
Name:
Dihydrofolate reductase
Synonyms:
DYR_RAT Dihydrofolate reductase (DHFR) Tetrahydrofolate dehydrogenase
Type:
Enzyme
Mol. Mass.:
21638.84
Organism:
Rattus norvegicus (rat)
Description:
Residue:
187
  
Inhibitor
Name:
BDBM50050409
Synonyms:
5-Methyl-6-{[methyl-(5,6,7,8-tetrahydro-naphthalen-1-yl)-amino]-methyl}-pyrido[2,3-d]pyrimidine-2,4-diamine | CHEMBL23220
Type:
Small organic molecule
Emp. Form.:
C20H24N6
Mol. Mass.:
348.4448
SMILES:
CN(Cc1cnc2nc(N)nc(N)c2c1C)c1cccc2CCCCc12
: