Target
Dihydrofolate reductase
Ligand
BDBM50050395
Substrate
Meas. Tech.
ChEMBL_55115 (CHEMBL665442)
IC50
22900±n/a nM
Citation
 Piper, JRJohnson, CAKrauth, CACarter, RLHosmer, CAQueener, SFBorotz, SEPfefferkorn, ER Lipophilic antifolates as agents against opportunistic infections. 1. Agents superior to trimetrexate and piritrexim against Toxoplasma gondii and Pneumocystis carinii in in vitro evaluations. J Med Chem 39:1271-80 (1996)  
Target
Name:
Dihydrofolate reductase
Synonyms:
DYR_RAT Dihydrofolate reductase (DHFR) Tetrahydrofolate dehydrogenase
Type:
Enzyme
Mol. Mass.:
21638.84
Organism:
Rattus norvegicus (rat)
Description:
Residue:
187
  
Inhibitor
Name:
BDBM50050395
Synonyms:
6-[(2,5-Dimethoxy-phenylamino)-methyl]-pteridine-2,4-diamine | CHEMBL23402
Type:
Small organic molecule
Emp. Form.:
C15H17N7O2
Mol. Mass.:
327.3412
SMILES:
COc1ccc(OC)c(NCc2cnc3nc(N)nc(N)c3n2)c1
: