Target
Dihydrofolate reductase
Ligand
BDBM50050412
Substrate
Meas. Tech.
ChEMBL_55115 (CHEMBL665442)
IC50
130±n/a nM
Citation
 Piper, JRJohnson, CAKrauth, CACarter, RLHosmer, CAQueener, SFBorotz, SEPfefferkorn, ER Lipophilic antifolates as agents against opportunistic infections. 1. Agents superior to trimetrexate and piritrexim against Toxoplasma gondii and Pneumocystis carinii in in vitro evaluations. J Med Chem 39:1271-80 (1996)  
Target
Name:
Dihydrofolate reductase
Synonyms:
DYR_RAT Dihydrofolate reductase (DHFR) Tetrahydrofolate dehydrogenase
Type:
Enzyme
Mol. Mass.:
21638.84
Organism:
Rattus norvegicus (rat)
Description:
Residue:
187
  
Inhibitor
Name:
BDBM50050412
Synonyms:
5-Methyl-6-[(5,6,7,8-tetrahydro-naphthalen-1-ylamino)-methyl]-pyrido[2,3-d]pyrimidine-2,4-diamine | CHEMBL282948
Type:
Small organic molecule
Emp. Form.:
C19H22N6
Mol. Mass.:
334.4182
SMILES:
Cc1c(CNc2cccc3CCCCc23)cnc2nc(N)nc(N)c12
: