Target
Dihydrofolate reductase
Ligand
BDBM50050406
Substrate
Meas. Tech.
ChEMBL_55115 (CHEMBL665442)
IC50
7700±n/a nM
Citation
 Piper, JRJohnson, CAKrauth, CACarter, RLHosmer, CAQueener, SFBorotz, SEPfefferkorn, ER Lipophilic antifolates as agents against opportunistic infections. 1. Agents superior to trimetrexate and piritrexim against Toxoplasma gondii and Pneumocystis carinii in in vitro evaluations. J Med Chem 39:1271-80 (1996)  
Target
Name:
Dihydrofolate reductase
Synonyms:
DYR_RAT Dihydrofolate reductase (DHFR) Tetrahydrofolate dehydrogenase
Type:
Enzyme
Mol. Mass.:
21638.84
Organism:
Rattus norvegicus (rat)
Description:
Residue:
187
  
Inhibitor
Name:
BDBM50050406
Synonyms:
6-(3-Methoxy-phenylsulfanylmethyl)-pteridine-2,4-diamine | CHEMBL23380
Type:
Small organic molecule
Emp. Form.:
C14H14N6OS
Mol. Mass.:
314.366
SMILES:
COc1cccc(SCc2cnc3nc(N)nc(N)c3n2)c1
: