Target
Dihydrofolate reductase
Ligand
BDBM50034940
Substrate
Meas. Tech.
ChEMBL_55115 (CHEMBL665442)
IC50
5.2±n/a nM
Citation
 Piper, JRJohnson, CAKrauth, CACarter, RLHosmer, CAQueener, SFBorotz, SEPfefferkorn, ER Lipophilic antifolates as agents against opportunistic infections. 1. Agents superior to trimetrexate and piritrexim against Toxoplasma gondii and Pneumocystis carinii in in vitro evaluations. J Med Chem 39:1271-80 (1996)  
Target
Name:
Dihydrofolate reductase
Synonyms:
DYR_RAT Dihydrofolate reductase (DHFR) Tetrahydrofolate dehydrogenase
Type:
Enzyme
Mol. Mass.:
21638.84
Organism:
Rattus norvegicus (rat)
Description:
Residue:
187
  
Inhibitor
Name:
BDBM50034940
Synonyms:
6-{[(3,4-Dimethoxy-phenyl)-methyl-amino]-methyl}-5-methyl-pyrido[2,3-d]pyrimidine-2,4-diamine | CHEMBL279680
Type:
Small organic molecule
Emp. Form.:
C18H22N6O2
Mol. Mass.:
354.4063
SMILES:
COc1ccc(cc1OC)N(C)Cc1cnc2nc(N)nc(N)c2c1C
: