Target
Adenylate cyclase type 5
Ligand
BDBM50050489
Substrate
Meas. Tech.
ChEMBL_31438 (CHEMBL645311)
EC50
1100±n/a nM
Citation
 Yamada, KRice, KCFlippen-Anderson, JLEissenstat, MAWard, SJJohnson, MRHowlett, AC (Aminoalkyl)indole isothiocyanates as potential electrophilic affinity ligands for the brain cannabinoid receptor. J Med Chem 39:1967-74 (1996)  
Target
Name:
Adenylate cyclase type 5
Synonyms:
ADCY5_RAT Adcy5 Adenylate cyclase type IX Adenylyl cyclase 5
Type:
PROTEIN
Mol. Mass.:
139188.88
Organism:
Rattus norvegicus
Description:
ChEMBL_31725
Residue:
1262
  
Inhibitor
Name:
BDBM50050489
Synonyms:
CHEMBL61448 | [6-Isothiocyanato-1-(2-morpholin-4-yl-ethyl)-1H-indol-3-yl]-naphthalen-1-yl-methanone
Type:
Small organic molecule
Emp. Form.:
C26H23N3O2S
Mol. Mass.:
441.545
SMILES:
O=C(c1cn(CCN2CCOCC2)c2cc(ccc12)N=C=S)c1cccc2ccccc12
: