Target
Sterol O-acyltransferase 1
Ligand
BDBM50050738
Substrate
Meas. Tech.
ChEMBL_28794 (CHEMBL641704)
IC50
1400±n/a nM
Citation
 Vaccaro, WAmore, CBerger, JBurrier, RClader, JDavis, HDomalski, MFevig, TSalisbury, BSher, R Inhibitors of acyl CoA:cholesterol acyltransferase. J Med Chem 39:1704-19 (1996)  
Target
Name:
Sterol O-acyltransferase 1
Synonyms:
ACAT-1 Acat SOAT1_RAT Sterol O-acyltransferase, Soat
Type:
PROTEIN
Mol. Mass.:
64165.56
Organism:
Rattus norvegicus
Description:
ChEMBL_28796
Residue:
545
  
Inhibitor
Name:
BDBM50050738
Synonyms:
CHEMBL45580 | N-[(3R,4R)-3-(4-Hydroxy-phenyl)-chroman-4-yl]-2,2-diphenyl-acetamide
Type:
Small organic molecule
Emp. Form.:
C29H25NO3
Mol. Mass.:
435.5137
SMILES:
Oc1ccc(cc1)[C@H]1COc2ccccc2[C@@H]1NC(=O)C(c1ccccc1)c1ccccc1
: