Target
Endothelin-1 receptor
Ligand
BDBM50050806
Substrate
Meas. Tech.
ChEMBL_65645 (CHEMBL678557)
Ki
1±n/a nM
Citation
 Riechers, HAlbrecht, HPAmberg, WBaumann, EBernard, HBöhm, HJKlinge, DKling, AMüller, SRaschack, MUnger, LWalker, NWernet, W Discovery and optimization of a novel class of orally active nonpeptidic endothelin-A receptor antagonists. J Med Chem 39:2123-8 (1996)  
Target
Name:
Endothelin-1 receptor
Synonyms:
EDNRA ET-A ETA-R Endothelin receptor type A hET-AR
Type:
Enzyme Catalytic Domain
Mol. Mass.:
48736.88
Organism:
Homo sapiens (Human)
Description:
P25101
Residue:
427
  
Inhibitor
Name:
BDBM50050806
Synonyms:
2-(4,6-Dimethyl-pyrimidin-2-yloxy)-3-methoxy-3,3-diphenyl-propionic acid | CHEMBL302753
Type:
Small organic molecule
Emp. Form.:
C22H22N2O4
Mol. Mass.:
378.4211
SMILES:
COC(C(Oc1nc(C)cc(C)n1)C(O)=O)(c1ccccc1)c1ccccc1
: