Target
Alpha-1B adrenergic receptor
Ligand
BDBM50050917
Substrate
Meas. Tech.
ChEMBL_34636 (CHEMBL647281)
Ki
102.9±n/a nM
Citation
 Quaglia, WPigini, MTayebati, SKPiergentili, AGiannella, MLeonardi, ATaddei, CMelchiorre, C Synthesis, absolute configuration, and biological profile of the enantiomers of trans-[2-(2,6-dimethoxyphenoxy)ethyl] [(3-p-tolyl-2,3-dihydro-1,4-benzodioxin-2-yl)methyl]amine (mephendioxan), a potent competitive alpha 1A-adrenoreceptor antagonist. J Med Chem 39:2253-8 (1996)  
Target
Name:
Alpha-1B adrenergic receptor
Synonyms:
ADA1B_RAT Alpha 1B-adrenoceptor Alpha adrenergic receptor 1A and 1B Alpha-1Adrenoceptor Alpha-1B adrenoreceptor | adrenergic Alpha1B
Type:
G Protein-Coupled Receptor (GPCR)
Mol. Mass.:
56606.71
Organism:
Rattus norvegicus (rat)
Description:
Receptor binding assays were performed using rat cortical membranes.
Residue:
515
  
Inhibitor
Name:
BDBM50050917
Synonyms:
CHEMBL42539 | [2-(2,6-Dimethoxy-phenoxy)-ethyl]-(3-p-tolyl-2,3-dihydro-benzo[1,4]dioxin-2-ylmethyl)-amine
Type:
Small organic molecule
Emp. Form.:
C26H29NO5
Mol. Mass.:
435.5122
SMILES:
COc1cccc(OC)c1OCCNCC1Oc2ccccc2OC1c1ccc(C)cc1
: