Target
Alpha-1A adrenergic receptor
Ligand
BDBM50050917
Substrate
Meas. Tech.
ChEMBL_33585 (CHEMBL647136)
Ki
0.91±n/a nM
Citation
 Quaglia, WPigini, MTayebati, SKPiergentili, AGiannella, MLeonardi, ATaddei, CMelchiorre, C Synthesis, absolute configuration, and biological profile of the enantiomers of trans-[2-(2,6-dimethoxyphenoxy)ethyl] [(3-p-tolyl-2,3-dihydro-1,4-benzodioxin-2-yl)methyl]amine (mephendioxan), a potent competitive alpha 1A-adrenoreceptor antagonist. J Med Chem 39:2253-8 (1996)  
Target
Name:
Alpha-1A adrenergic receptor
Synonyms:
ADA1A_BOVIN ADRA1C Alpha 1A-adrenoreceptor Cerebral cortex alpha adrenergic receptor | adrenergic Alpha1
Type:
Enzyme Catalytic Domain
Mol. Mass.:
51492.08
Organism:
CALF
Description:
adrenergic Alpha1 0 CALF
Residue:
466
  
Inhibitor
Name:
BDBM50050917
Synonyms:
CHEMBL42539 | [2-(2,6-Dimethoxy-phenoxy)-ethyl]-(3-p-tolyl-2,3-dihydro-benzo[1,4]dioxin-2-ylmethyl)-amine
Type:
Small organic molecule
Emp. Form.:
C26H29NO5
Mol. Mass.:
435.5122
SMILES:
COc1cccc(OC)c1OCCNCC1Oc2ccccc2OC1c1ccc(C)cc1
: