Target
Delta-type opioid receptor
Ligand
BDBM50051178
Substrate
Meas. Tech.
ChEMBL_146879 (CHEMBL750006)
IC50
12±n/a nM
Citation
 Lung, FDCollins, NStropova, DDavis, PYamamura, HIPorreca, FHruby, VJ Design, synthesis, and biological activities of cyclic lactam peptide analogues of dynorphine A(1-11)-NH2. J Med Chem 39:1136-41 (1996)  
Target
Name:
Delta-type opioid receptor
Synonyms:
D-OR-1 Delta opioid receptor OPIATE Delta OPRD1 OPRK1 | opioid receptor, delta 1
Type:
G Protein-Coupled Receptor (GPCR)
Mol. Mass.:
40382.98
Organism:
Homo sapiens (Human)
Description:
Competition binding assays were carried out using membrane preparations from transfected HN9.10 cells that constitutively expressed the delta opioid receptor.
Residue:
372
  
Inhibitor
Name:
BDBM50051178
Synonyms:
CHEMBL413011 | Cyclic Lactam Peptide Analogues of Dynorphin A(1-11)-NH2Cyclic Lactam Peptide Analogues of Dynorphin A(1-11)-NH2
Type:
Small organic molecule
Emp. Form.:
C65H104N20O13
Mol. Mass.:
1373.6475
SMILES:
CC[C@H](C)[C@H](NC(=O)[C@H](CCCNC(N)=N)NC(=O)[C@@H]1CCCCNC(=O)C[C@H](NC(=O)[C@@H](N)Cc2ccc(O)cc2)C(=O)NCC(=O)N[C@H](Cc2ccccc2)C(=O)N[C@@H](CC(C)C)C(=O)N1)C(=O)N[C@@H](CCCNC(N)=N)C(=O)N1CCC[C@@H]1C(=O)N[C@H](CCCCN)C(N)=O
: