Target
Adenosine receptor A3
Ligand
BDBM50051339
Substrate
Meas. Tech.
ChEMBL_31838 (CHEMBL641515)
Ki
50100.0±n/a nM
Citation
 Karton, YJiang, JLJi, XDMelman, NOlah, MEStiles, GLJacobson, KA Synthesis and biological activities of flavonoid derivatives as A3 adenosine receptor antagonists. J Med Chem 39:2293-301 (1996)  
Target
Name:
Adenosine receptor A3
Synonyms:
A3 adenosine receptor (hA3) ADORA3 | Adenosine A3 receptor (A3AR)
Type:
G Protein-Coupled Receptor (GPCR)
Mol. Mass.:
36197.32
Organism:
Homo sapiens (Human)
Description:
P0DMS8
Residue:
318
  
Inhibitor
Name:
BDBM50051339
Synonyms:
3-Hydroxy-2-(2,4,6-trimethoxy-phenyl)-chromen-4-one | CHEMBL76933
Type:
Small organic molecule
Emp. Form.:
C18H16O6
Mol. Mass.:
328.316
SMILES:
COc1cc(OC)c(c(OC)c1)-c1oc2ccccc2c(=O)c1O
: