Target
Adenosine receptor A3
Ligand
BDBM50051347
Substrate
Meas. Tech.
ChEMBL_31838 (CHEMBL641515)
Ki
364±n/a nM
Citation
 Karton, YJiang, JLJi, XDMelman, NOlah, MEStiles, GLJacobson, KA Synthesis and biological activities of flavonoid derivatives as A3 adenosine receptor antagonists. J Med Chem 39:2293-301 (1996)  
Target
Name:
Adenosine receptor A3
Synonyms:
A3 adenosine receptor (hA3) ADORA3 | Adenosine A3 receptor (A3AR)
Type:
G Protein-Coupled Receptor (GPCR)
Mol. Mass.:
36197.32
Organism:
Homo sapiens (Human)
Description:
P0DMS8
Residue:
318
  
Inhibitor
Name:
BDBM50051347
Synonyms:
3,5,7-Triethoxy-2-phenyl-chromen-4-one | CHEMBL72862
Type:
Small organic molecule
Emp. Form.:
C21H22O5
Mol. Mass.:
354.3964
SMILES:
CCOc1cc(OCC)c2c(c1)oc(-c1ccccc1)c(OCC)c2=O
: