Target
Adenosine receptor A3
Ligand
BDBM50051354
Substrate
Meas. Tech.
ChEMBL_31838 (CHEMBL641515)
Ki
11500±n/a nM
Citation
 Karton, YJiang, JLJi, XDMelman, NOlah, MEStiles, GLJacobson, KA Synthesis and biological activities of flavonoid derivatives as A3 adenosine receptor antagonists. J Med Chem 39:2293-301 (1996)  
Target
Name:
Adenosine receptor A3
Synonyms:
A3 adenosine receptor (hA3) ADORA3 | Adenosine A3 receptor (A3AR)
Type:
G Protein-Coupled Receptor (GPCR)
Mol. Mass.:
36197.32
Organism:
Homo sapiens (Human)
Description:
P0DMS8
Residue:
318
  
Inhibitor
Name:
BDBM50051354
Synonyms:
3-Chloro-2-phenyl-chromen-4-one | CHEMBL74975
Type:
Small organic molecule
Emp. Form.:
C15H9ClO2
Mol. Mass.:
256.684
SMILES:
Clc1c(oc2ccccc2c1=O)-c1ccccc1
: