Target
Adenosine receptor A3
Ligand
BDBM50051343
Substrate
Meas. Tech.
ChEMBL_31838 (CHEMBL641515)
Ki
3950±n/a nM
Citation
 Karton, YJiang, JLJi, XDMelman, NOlah, MEStiles, GLJacobson, KA Synthesis and biological activities of flavonoid derivatives as A3 adenosine receptor antagonists. J Med Chem 39:2293-301 (1996)  
Target
Name:
Adenosine receptor A3
Synonyms:
A3 adenosine receptor (hA3) ADORA3 | Adenosine A3 receptor (A3AR)
Type:
G Protein-Coupled Receptor (GPCR)
Mol. Mass.:
36197.32
Organism:
Homo sapiens (Human)
Description:
P0DMS8
Residue:
318
  
Inhibitor
Name:
BDBM50051343
Synonyms:
4-Propoxy-7-((E)-styryl)-furo[3,2-g]chromen-5-one | CHEMBL76128
Type:
Small organic molecule
Emp. Form.:
C22H18O4
Mol. Mass.:
346.3759
SMILES:
CCCOc1c2ccoc2cc2oc(\C=C\c3ccccc3)cc(=O)c12
: