Target
Lanosterol synthase
Ligand
BDBM50051380
Substrate
Meas. Tech.
ChEMBL_148911 (CHEMBL756148)
IC50
700±n/a nM
Citation
 Barth, MMBinet, JLThomas, DMde Fornel, DCSamreth, SSchuber, FJRenaut, PP Structural and stereoelectronic requirements for the inhibition of mammalian 2,3-oxidosqualene cyclase by substituted isoquinoline derivatives. J Med Chem 39:2302-12 (1996)  
Target
Name:
Lanosterol synthase
Synonyms:
LSS_RAT Osc
Type:
PROTEIN
Mol. Mass.:
83302.12
Organism:
Rattus norvegicus
Description:
ChEMBL_12083
Residue:
733
  
Inhibitor
Name:
BDBM50051380
Synonyms:
(4aS,6S,8aS)-2-((E)-5,9-Dimethyl-deca-4,8-dienyl)-5,5,8a-trimethyl-decahydro-isoquinolin-6-ol | CHEMBL74029
Type:
Small organic molecule
Emp. Form.:
C24H43NO
Mol. Mass.:
361.6043
SMILES:
[#6]\[#6](-[#6])=[#6]/[#6]-[#6]\[#6](-[#6])=[#6]\[#6]-[#6]-[#6]-[#7]-1-[#6]-[#6]-[#6@@H]2C([#6])([#6])[#6@@H](-[#8])-[#6]-[#6][C@]2([#6])[#6]-1
: