Target
Lanosterol synthase
Ligand
BDBM50051382
Substrate
Meas. Tech.
ChEMBL_148911 (CHEMBL756148)
IC50
16400±n/a nM
Citation
 Barth, MMBinet, JLThomas, DMde Fornel, DCSamreth, SSchuber, FJRenaut, PP Structural and stereoelectronic requirements for the inhibition of mammalian 2,3-oxidosqualene cyclase by substituted isoquinoline derivatives. J Med Chem 39:2302-12 (1996)  
Target
Name:
Lanosterol synthase
Synonyms:
LSS_RAT Osc
Type:
PROTEIN
Mol. Mass.:
83302.12
Organism:
Rattus norvegicus
Description:
ChEMBL_12083
Residue:
733
  
Inhibitor
Name:
BDBM50051382
Synonyms:
(6S,8aS)-2-Dodecyl-8a-methyl-1,2,3,5,6,7,8,8a-octahydro-isoquinolin-6-ol | CHEMBL421314
Type:
Small organic molecule
Emp. Form.:
C22H41NO
Mol. Mass.:
335.567
SMILES:
CCCCCCCCCCCCN1CC=C2C[C@@H](O)CC[C@]2(C)C1
: