Target
Adenosine receptor A2a
Ligand
BDBM50051667
Substrate
Meas. Tech.
ChEMBL_31067 (CHEMBL640427)
Ki
>10000±n/a nM
Citation
 Müller, CEGeis, UGrahner, BLanzner, WEger, K Chiral pyrrolo[2,3-d]pyrimidine and pyrimido[4,5-b]indole derivatives: structure-activity relationships of potent, highly stereoselective A1-adenosine receptor antagonists. J Med Chem 39:2482-91 (1996)  
Target
Name:
Adenosine receptor A2a
Synonyms:
AA2AR_RAT Adenosine A2 receptor Adenosine Receptors A2a (A2a) Adenosine receptors A2a Rat striatal adenosine A2a receptor
Type:
G Protein-Coupled Receptor (GPCR)
Mol. Mass.:
45015.65
Organism:
Rattus norvegicus (rat)
Description:
Rat A2A receptors expressed in CHO cells.
Residue:
410
  
Inhibitor
Name:
BDBM50051667
Synonyms:
2-(3-Methoxy-phenyl)-5,6-dimethyl-7-((R)-1-phenyl-ethyl)-7H-pyrrolo[2,3-d]pyrimidin-4-ylamine | CHEMBL311664
Type:
Small organic molecule
Emp. Form.:
C23H24N4O
Mol. Mass.:
372.4629
SMILES:
COc1cccc(c1)-c1nc(N)c2c(C)c(C)n([C@H](C)c3ccccc3)c2n1
: