Target
Adenosine receptor A2a
Ligand
BDBM50051648
Substrate
Meas. Tech.
ChEMBL_31067 (CHEMBL640427)
Ki
21400±n/a nM
Citation
 Müller, CEGeis, UGrahner, BLanzner, WEger, K Chiral pyrrolo[2,3-d]pyrimidine and pyrimido[4,5-b]indole derivatives: structure-activity relationships of potent, highly stereoselective A1-adenosine receptor antagonists. J Med Chem 39:2482-91 (1996)  
Target
Name:
Adenosine receptor A2a
Synonyms:
AA2AR_RAT Adenosine A2 receptor Adenosine Receptors A2a (A2a) Adenosine receptors A2a Rat striatal adenosine A2a receptor
Type:
G Protein-Coupled Receptor (GPCR)
Mol. Mass.:
45015.65
Organism:
Rattus norvegicus (rat)
Description:
Rat A2A receptors expressed in CHO cells.
Residue:
410
  
Inhibitor
Name:
BDBM50051648
Synonyms:
2-Phenyl-9-((R)-1-p-tolyl-ethyl)-9H-pyrimido[4,5-b]indol-4-ylamine | CHEMBL310728
Type:
Small organic molecule
Emp. Form.:
C25H22N4
Mol. Mass.:
378.469
SMILES:
C[C@H](c1ccc(C)cc1)n1c2ccccc2c2c(N)nc(nc12)-c1ccccc1
: