Target
Adenosine receptor A2a
Ligand
BDBM50051671
Substrate
Meas. Tech.
ChEMBL_31067 (CHEMBL640427)
Ki
>30000±n/a nM
Citation
 Müller, CEGeis, UGrahner, BLanzner, WEger, K Chiral pyrrolo[2,3-d]pyrimidine and pyrimido[4,5-b]indole derivatives: structure-activity relationships of potent, highly stereoselective A1-adenosine receptor antagonists. J Med Chem 39:2482-91 (1996)  
Target
Name:
Adenosine receptor A2a
Synonyms:
AA2AR_RAT Adenosine A2 receptor Adenosine Receptors A2a (A2a) Adenosine receptors A2a Rat striatal adenosine A2a receptor
Type:
G Protein-Coupled Receptor (GPCR)
Mol. Mass.:
45015.65
Organism:
Rattus norvegicus (rat)
Description:
Rat A2A receptors expressed in CHO cells.
Residue:
410
  
Inhibitor
Name:
BDBM50051671
Synonyms:
2-(4-Chloro-phenyl)-5,6-dimethyl-7-((S)-1-phenyl-ethyl)-3,7-dihydro-pyrrolo[2,3-d]pyrimidin-4-one | CHEMBL82059
Type:
Small organic molecule
Emp. Form.:
C22H20ClN3O
Mol. Mass.:
377.867
SMILES:
C[C@@H](c1ccccc1)n1c(C)c(C)c2c1nc([nH]c2=O)-c1ccc(Cl)cc1
: