Target
Adenosine receptor A1
Ligand
BDBM50051675
Substrate
Meas. Tech.
ChEMBL_29636 (CHEMBL639743)
Ki
297±n/a nM
Citation
 Müller, CEGeis, UGrahner, BLanzner, WEger, K Chiral pyrrolo[2,3-d]pyrimidine and pyrimido[4,5-b]indole derivatives: structure-activity relationships of potent, highly stereoselective A1-adenosine receptor antagonists. J Med Chem 39:2482-91 (1996)  
Target
Name:
Adenosine receptor A1
Synonyms:
AA1R_RAT ADENOSINE A1 high Adenosine A1 receptor (A1) Adenosine receptors A1 | Adora1
Type:
Protein
Mol. Mass.:
36704.13
Organism:
Rattus norvegicus (rat)
Description:
Residue:
326
  
Inhibitor
Name:
BDBM50051675
Synonyms:
2-Phenyl-9-((S)-1-p-tolyl-ethyl)-9H-pyrimido[4,5-b]indol-4-ylamine | CHEMBL84996
Type:
Small organic molecule
Emp. Form.:
C25H22N4
Mol. Mass.:
378.469
SMILES:
C[C@@H](c1ccc(C)cc1)n1c2ccccc2c2c(N)nc(nc12)-c1ccccc1
: