Target
Xanthine dehydrogenase/oxidase
Ligand
BDBM50051716
Substrate
Meas. Tech.
ChEMBL_217078 (CHEMBL823474)
IC50
4290±n/a nM
Citation
 Biagi, GCostantini, ACostantino, LGiorgi, ILivi, OPecorari, PRinaldi, MScartoni, V Synthesis and biological evaluation of new imidazole, pyrimidine, and purine derivatives and analogs as inhibitors of xanthine oxidase. J Med Chem 39:2529-35 (1996)  
Target
Name:
Xanthine dehydrogenase/oxidase
Synonyms:
XD XDHA XO Xanthine dehydrogenase/oxidase | Xanthine oxidase
Type:
Enzyme
Mol. Mass.:
146441.21
Organism:
Homo sapiens (Human)
Description:
P47989
Residue:
1333
  
Inhibitor
Name:
BDBM50051716
Synonyms:
CHEMBL84643 | N-(5-Carbamoyl-3H-imidazol-4-yl)-oxalamic acid butyl ester
Type:
Small organic molecule
Emp. Form.:
C10H14N4O4
Mol. Mass.:
254.2426
SMILES:
CCCCOC(=O)C(=O)Nc1nc[nH]c1C(N)=O
: