Target
Xanthine dehydrogenase/oxidase
Ligand
BDBM50013077
Substrate
Meas. Tech.
ChEMBL_217078 (CHEMBL823474)
IC50
30500±n/a nM
Citation
 Biagi, GCostantini, ACostantino, LGiorgi, ILivi, OPecorari, PRinaldi, MScartoni, V Synthesis and biological evaluation of new imidazole, pyrimidine, and purine derivatives and analogs as inhibitors of xanthine oxidase. J Med Chem 39:2529-35 (1996)  
Target
Name:
Xanthine dehydrogenase/oxidase
Synonyms:
XD XDHA XO Xanthine dehydrogenase/oxidase | Xanthine oxidase
Type:
Enzyme
Mol. Mass.:
146441.21
Organism:
Homo sapiens (Human)
Description:
P47989
Residue:
1333
  
Inhibitor
Name:
BDBM50013077
Synonyms:
2-Hexylamino-1,9-dihydro-purin-6-one CHEMBL64616
Type:
Small organic molecule
Emp. Form.:
C11H17N5O
Mol. Mass.:
235.2856
SMILES:
CCCCCCNc1nc2nc[nH]c2c(=O)[nH]1
: