Target
Xanthine dehydrogenase/oxidase
Ligand
BDBM50051742
Substrate
Meas. Tech.
ChEMBL_217078 (CHEMBL823474)
IC50
36520±n/a nM
Citation
 Biagi, GCostantini, ACostantino, LGiorgi, ILivi, OPecorari, PRinaldi, MScartoni, V Synthesis and biological evaluation of new imidazole, pyrimidine, and purine derivatives and analogs as inhibitors of xanthine oxidase. J Med Chem 39:2529-35 (1996)  
Target
Name:
Xanthine dehydrogenase/oxidase
Synonyms:
XD XDHA XO Xanthine dehydrogenase/oxidase | Xanthine oxidase
Type:
Enzyme
Mol. Mass.:
146441.21
Organism:
Homo sapiens (Human)
Description:
P47989
Residue:
1333
  
Inhibitor
Name:
BDBM50051742
Synonyms:
2-Phenyl-7,8-dihydro-3H,6H-5-thia-1,3,4,8a-tetraaza-cyclopenta[b]naphthalen-9-one | CHEMBL315735
Type:
Small organic molecule
Emp. Form.:
C14H12N4OS
Mol. Mass.:
284.336
SMILES:
O=c1n2CCCSc2nc2[nH]c(nc12)-c1ccccc1
: