Target
Sodium-dependent serotonin transporter
Ligand
BDBM50051758
Substrate
Meas. Tech.
ChEMBL_201802 (CHEMBL806137)
Ki
5.3±n/a nM
Citation
 Davies, HMKuhn, LAThornley, CMatasi, JJSexton, TChilders, SR Synthesis of 3 beta-aryl-8-azabicyclo[3.2.1]octanes with high binding affinities and selectivities for the serotonin transporter site. J Med Chem 39:2554-8 (1996)  
Target
Name:
Sodium-dependent serotonin transporter
Synonyms:
5-HT Transporter 5HT transporter Anandamid membrane transporter, AMT Monoamine transporters; Norepinephrine & serotonin Slc6a4 Sodium-dependent serotonin transporter (SERT) | imipramine receptor
Type:
Multi-pass membrane protein
Mol. Mass.:
70168.43
Organism:
Rattus norvegicus (rat)
Description:
P31652
Residue:
630
  
Inhibitor
Name:
BDBM50051758
Synonyms:
1-[3-(4-Isopropyl-phenyl)-8-aza-bicyclo[3.2.1]oct-2-yl]-propan-1-one | CHEMBL85256
Type:
Small organic molecule
Emp. Form.:
C19H27NO
Mol. Mass.:
285.4238
SMILES:
CCC(=O)C1C2CCC(CC1c1ccc(cc1)C(C)C)N2
: