Target
Sterol O-acyltransferase 1
Ligand
BDBM50051895
Substrate
Meas. Tech.
ChEMBL_28796 (CHEMBL641706)
IC50
4±n/a nM
Citation
 Astles, PCAshton, MJBridge, AWHarris, NVHart, TWParrott, DPPorter, BRiddell, DSmith, CWilliams, RJ Acyl-CoA:Cholesterol O-acyltransferase (ACAT) inhibitors. 2. 2-(1,3-Dioxan-2-yl)-4,5-diphenyl-1H-imidazoles as potent inhibitors of ACAT. J Med Chem 39:1423-32 (1996)  
Target
Name:
Sterol O-acyltransferase 1
Synonyms:
ACAT-1 Acat SOAT1_RAT Sterol O-acyltransferase, Soat
Type:
PROTEIN
Mol. Mass.:
64165.56
Organism:
Rattus norvegicus
Description:
ChEMBL_28796
Residue:
545
  
Inhibitor
Name:
BDBM50051895
Synonyms:
2-(2,4-Dioxa-spiro[5.5]undec-3-yl)-4,5-diphenyl-1H-imidazole | CHEMBL284029
Type:
Small organic molecule
Emp. Form.:
C24H26N2O2
Mol. Mass.:
374.4754
SMILES:
C1CCC2(CC1)COC(OC2)c1nc(c([nH]1)-c1ccccc1)-c1ccccc1
: