Target
Sodium channel protein type 2 subunit alpha
Ligand
BDBM50051986
Substrate
Meas. Tech.
ChEMBL_213124 (CHEMBL818203)
IC50
4400±n/a nM
Citation
 Roufos, IHays, SSchwarz, RD A structure-activity relationship study of novel phenylacetamides which are sodium channel blockers. J Med Chem 39:1514-20 (1996)  
Target
Name:
Sodium channel protein type 2 subunit alpha
Synonyms:
SCN2A_RAT Scn2a1 Sodium channel protein type 2 subunit alpha Sodium channel protein type II subunit alpha Voltage-gated sodium channel | Voltage-gated sodium channel subunit alpha Nav1.2
Type:
PROTEIN
Mol. Mass.:
227854.11
Organism:
Rattus norvegicus
Description:
ChEMBL_1516893
Residue:
2005
  
Inhibitor
Name:
BDBM50051986
Synonyms:
CHEMBL40788 | N-(3-Diethylamino-propyl)-2,2-diphenyl-acetamide
Type:
Small organic molecule
Emp. Form.:
C21H28N2O
Mol. Mass.:
324.4598
SMILES:
CCN(CC)CCCNC(=O)C(c1ccccc1)c1ccccc1
: