Target
Sodium channel protein type 2 subunit alpha
Ligand
BDBM50051988
Substrate
Meas. Tech.
ChEMBL_213124 (CHEMBL818203)
IC50
2200±n/a nM
Citation
 Roufos, IHays, SSchwarz, RD A structure-activity relationship study of novel phenylacetamides which are sodium channel blockers. J Med Chem 39:1514-20 (1996)  
Target
Name:
Sodium channel protein type 2 subunit alpha
Synonyms:
SCN2A_RAT Scn2a1 Sodium channel protein type 2 subunit alpha Sodium channel protein type II subunit alpha Voltage-gated sodium channel | Voltage-gated sodium channel subunit alpha Nav1.2
Type:
PROTEIN
Mol. Mass.:
227854.11
Organism:
Rattus norvegicus
Description:
ChEMBL_1516893
Residue:
2005
  
Inhibitor
Name:
BDBM50051988
Synonyms:
CHEMBL38095 | N-[3-(4-Hydroxy-4-phenyl-piperidin-1-yl)-propyl]-2,2-diphenyl-acetamide
Type:
Small organic molecule
Emp. Form.:
C28H32N2O2
Mol. Mass.:
428.5659
SMILES:
OC1(CCN(CCCNC(=O)C(c2ccccc2)c2ccccc2)CC1)c1ccccc1
: