Target
Glutathione reductase, mitochondrial
Ligand
BDBM50052001
Substrate
Meas. Tech.
ChEMBL_72475 (CHEMBL685508)
IC50
2500±n/a nM
Citation
 Schönleben-Janas, AKirsch, PMittl, PRSchirmer, RHKrauth-Siegel, RL Inhibition of human glutathione reductase by 10-arylisoalloxazines: crystalline, kinetic, and electrochemical studies. J Med Chem 39:1549-54 (1996)  
Target
Name:
Glutathione reductase, mitochondrial
Synonyms:
GLUR GSHR_HUMAN Glutathione reductase | Glutathione reductase (GR)
Type:
Enzyme
Mol. Mass.:
56271.52
Organism:
Homo sapiens (Human)
Description:
P00390
Residue:
522
  
Inhibitor
Name:
BDBM50052001
Synonyms:
8-Azido-10-(4-chloro-phenyl)-3-methyl-10H-benzo[g]pteridine-2,4-dione | CHEMBL39051
Type:
Small organic molecule
Emp. Form.:
C17H10ClN7O2
Mol. Mass.:
379.76
SMILES:
Cn1c(=O)nc2n(-c3ccc(Cl)cc3)c3cc(ccc3nc2c1=O)N=[N+]=[N-]
: