Target
Glutathione reductase, mitochondrial
Ligand
BDBM50051999
Substrate
Meas. Tech.
ChEMBL_72475 (CHEMBL685508)
IC50
40000±n/a nM
Citation
 Schönleben-Janas, AKirsch, PMittl, PRSchirmer, RHKrauth-Siegel, RL Inhibition of human glutathione reductase by 10-arylisoalloxazines: crystalline, kinetic, and electrochemical studies. J Med Chem 39:1549-54 (1996)  
Target
Name:
Glutathione reductase, mitochondrial
Synonyms:
GLUR GSHR_HUMAN Glutathione reductase | Glutathione reductase (GR)
Type:
Enzyme
Mol. Mass.:
56271.52
Organism:
Homo sapiens (Human)
Description:
P00390
Residue:
522
  
Inhibitor
Name:
BDBM50051999
Synonyms:
1-Methyl-4-(3-methyl-2,4-dioxo-3,4-dihydro-2H-benzo[g]pteridin-10-yl)-pyridinium | CHEMBL289117
Type:
Small organic molecule
Emp. Form.:
C17H14N5O2
Mol. Mass.:
320.3248
SMILES:
Cn1c(=O)nc2n(-c3cc[n+](C)cc3)c3ccccc3nc2c1=O
: