Target
D(4) dopamine receptor
Ligand
BDBM50454212
Substrate
Meas. Tech.
ChEMBL_63098 (CHEMBL674491)
Kd
0.210000±n/a nM
Citation
 Ohmori, JMaeno, KHidaka, KNakato, KMatsumoto, MTada, SHattori, HSakamoto, STsukamoto, SUsuda, SMase, T Dopamine D3 and D4 receptor antagonists: synthesis and structure--activity relationships of (S)-(+)-N-(1-Benzyl-3-pyrrolidinyl)-5-chloro-4- [(cyclopropylcarbonyl) amino]-2-methoxybenzamide (YM-43611) and related compounds. J Med Chem 39:2764-72 (1996)  
Target
Name:
D(4) dopamine receptor
Synonyms:
D(2C) dopamine receptor DOPAMINE D4.2 DRD4 Dopamine D4 receptor
Type:
Enzyme
Mol. Mass.:
48373.19
Organism:
Homo sapiens (Human)
Description:
P21917
Residue:
419
  
Inhibitor
Name:
BDBM50454212
Synonyms:
CHEBI:64217 Nemonapride
Type:
Small organic molecule
Emp. Form.:
C21H26ClN3O2
Mol. Mass.:
387.903
SMILES:
CNc1cc(OC)c(cc1Cl)C(=O)NC1CCN(Cc2ccccc2)C1C
: