Target
D(1A) dopamine receptor
Ligand
BDBM50052180
Substrate
Meas. Tech.
ChEMBL_60497 (CHEMBL674253)
Ki
>10000±n/a nM
Citation
 Ohmori, JMaeno, KHidaka, KNakato, KMatsumoto, MTada, SHattori, HSakamoto, STsukamoto, SUsuda, SMase, T Dopamine D3 and D4 receptor antagonists: synthesis and structure--activity relationships of (S)-(+)-N-(1-Benzyl-3-pyrrolidinyl)-5-chloro-4- [(cyclopropylcarbonyl) amino]-2-methoxybenzamide (YM-43611) and related compounds. J Med Chem 39:2764-72 (1996)  
Target
Name:
D(1A) dopamine receptor
Synonyms:
DA D1 receptor DRD1 Dopamine D1 receptor Dopamine D1A
Type:
Enzyme
Mol. Mass.:
49303.43
Organism:
Homo sapiens (Human)
Description:
P21728
Residue:
446
  
Inhibitor
Name:
BDBM50052180
Synonyms:
CHEMBL328866 | N-((S)-1-Benzyl-pyrrolidin-3-yl)-5-chloro-4-(cyclopropanecarbonyl-amino)-2-methoxy-benzamide
Type:
Small organic molecule
Emp. Form.:
C23H26ClN3O3
Mol. Mass.:
427.924
SMILES:
COc1cc(NC(=O)C2CC2)c(Cl)cc1C(=O)N[C@H]1CCN(Cc2ccccc2)C1
: